Target
Mitogen-activated protein kinase kinase kinase 5
Ligand
BDBM524909
Substrate
Meas. Tech.
TR-FRET Assay
IC50
<100.0±n/a nM
Citation
 Gonzalez Lopez de Turiso, FHimmelbauer, MLuzzio, MJ ASK1 inhibiting agents US Patent  US11168095 Publication Date 11/9/2021 
Target
Name:
Mitogen-activated protein kinase kinase kinase 5
Synonyms:
ASK1 MAP3K5 MEKK5
Type:
Protein
Mol. Mass.:
154514.93
Organism:
Homo sapiens (Human)
Description:
Q99683
Residue:
1374
  
Inhibitor
Name:
BDBM524909
Synonyms:
55-Bromo-14H-6-oxa-3-aza-2(2,6)-pyridina-1(3,4)-triazola-5(1,2)-benzenacycloundecaphan-4-one | US11168095, Example 170
Type:
Small organic molecule
Emp. Form.:
C19H18BrN5O2
Mol. Mass.:
428.283
SMILES:
Brc1ccc2OCCCCCn3cnnc3-c3cccc(NC(=O)c2c1)n3
: