Target
Son of sevenless homolog 1 [564-1049]
Ligand
BDBM524933
Substrate
Meas. Tech.
Surface Plasmon Resonance (SPR) Assay
IC50
20.4±n/a nM
Citation
 Gill, ALBuckl, AKoltun, ESAay, NTambo-ong, AAThompson, SGliedt, MJKnox, JECregg, JEdwards, AVLiu, YBurnett, GL Bicyclic heteroaryl compounds and uses thereof US Patent  US11168102 Publication Date 11/9/2021 
Target
Name:
Son of sevenless homolog 1 [564-1049]
Synonyms:
SOS1 Son of sevenless homolog 1 (SOS1)(564-1049)
Type:
Enzyme Catalytic Domain
Mol. Mass.:
56970.22
Organism:
Description:
aa 564-1049
Residue:
486
 
Inhibitor
Name:
BDBM524933
Synonyms:
US11168102, Example 1-16.
Type:
Small organic molecule
Emp. Form.:
C24H24F3N5O2
Mol. Mass.:
471.4749
SMILES:
C[C@@H](Nc1ncnc2n(C)c(=O)c(cc12)C1=CCN(CC1)C(C)=O)c1cccc(C(F)F)c1F
: