Target
Son of sevenless homolog 1 [564-1049]
Ligand
BDBM525065
Substrate
Meas. Tech.
Surface Plasmon Resonance (SPR) Assay
IC50
11.9±n/a nM
Citation
 Gill, ALBuckl, AKoltun, ESAay, NTambo-ong, AAThompson, SGliedt, MJKnox, JECregg, JEdwards, AVLiu, YBurnett, GL Bicyclic heteroaryl compounds and uses thereof US Patent  US11168102 Publication Date 11/9/2021 
Target
Name:
Son of sevenless homolog 1 [564-1049]
Synonyms:
SOS1 Son of sevenless homolog 1 (SOS1)(564-1049)
Type:
Enzyme Catalytic Domain
Mol. Mass.:
56970.22
Organism:
Description:
aa 564-1049
Residue:
486
 
Inhibitor
Name:
BDBM525065
Synonyms:
US11168102, Example 9.
Type:
Small organic molecule
Emp. Form.:
C22H23F3N6O
Mol. Mass.:
444.4528
SMILES:
C[C@@H](Nc1nc(C)nc2[nH]c(=O)c(cc12)C1=CCNCC1)c1cc(N)cc(c1)C(F)(F)F
: