Target
Son of sevenless homolog 1 [564-1049]
Ligand
BDBM525067
Substrate
Meas. Tech.
Surface Plasmon Resonance (SPR) Assay
IC50
13.6±n/a nM
Citation
 Gill, ALBuckl, AKoltun, ESAay, NTambo-ong, AAThompson, SGliedt, MJKnox, JECregg, JEdwards, AVLiu, YBurnett, GL Bicyclic heteroaryl compounds and uses thereof US Patent  US11168102 Publication Date 11/9/2021 
Target
Name:
Son of sevenless homolog 1 [564-1049]
Synonyms:
SOS1 Son of sevenless homolog 1 (SOS1)(564-1049)
Type:
Enzyme Catalytic Domain
Mol. Mass.:
56970.22
Organism:
Description:
aa 564-1049
Residue:
486
 
Inhibitor
Name:
BDBM525067
Synonyms:
US11168102, Example 12.
Type:
Small organic molecule
Emp. Form.:
C21H23F3N6O2
Mol. Mass.:
448.4415
SMILES:
C[C@@H](Nc1ncnc2n(C)c(=O)c(cc12)N1CCOCC1)c1cc(N)cc(c1)C(F)(F)F
: