Target
Son of sevenless homolog 1 [564-1049]
Ligand
BDBM525086
Substrate
Meas. Tech.
Surface Plasmon Resonance (SPR) Assay
IC50
20.9±n/a nM
Citation
 Gill, ALBuckl, AKoltun, ESAay, NTambo-ong, AAThompson, SGliedt, MJKnox, JECregg, JEdwards, AVLiu, YBurnett, GL Bicyclic heteroaryl compounds and uses thereof US Patent  US11168102 Publication Date 11/9/2021 
Target
Name:
Son of sevenless homolog 1 [564-1049]
Synonyms:
SOS1 Son of sevenless homolog 1 (SOS1)(564-1049)
Type:
Enzyme Catalytic Domain
Mol. Mass.:
56970.22
Organism:
Description:
aa 564-1049
Residue:
486
 
Inhibitor
Name:
BDBM525086
Synonyms:
US11168102, Example 23.
Type:
Small organic molecule
Emp. Form.:
C22H22F3N5O2S
Mol. Mass.:
477.503
SMILES:
C[C@@H](Nc1ncnc2n(C)c(=O)c(cc12)C1=CCS(=N)(=O)CC1)c1cccc(C(F)F)c1F
: