Target
Son of sevenless homolog 1 [564-1049]
Ligand
BDBM525101
Substrate
Meas. Tech.
Surface Plasmon Resonance (SPR) Assay
IC50
24.9±n/a nM
Citation
 Gill, ALBuckl, AKoltun, ESAay, NTambo-ong, AAThompson, SGliedt, MJKnox, JECregg, JEdwards, AVLiu, YBurnett, GL Bicyclic heteroaryl compounds and uses thereof US Patent  US11168102 Publication Date 11/9/2021 
Target
Name:
Son of sevenless homolog 1 [564-1049]
Synonyms:
SOS1 Son of sevenless homolog 1 (SOS1)(564-1049)
Type:
Enzyme Catalytic Domain
Mol. Mass.:
56970.22
Organism:
Description:
aa 564-1049
Residue:
486
 
Inhibitor
Name:
BDBM525101
Synonyms:
US11168102, Example 26-21.
Type:
Small organic molecule
Emp. Form.:
C24H26F3N5O3
Mol. Mass.:
489.4901
SMILES:
C[C@@H](Nc1ncnc2n(C)c(=O)c(cc12)C(=O)N1C[C@@H](C)O[C@H](C)C1)c1cccc(C(F)F)c1F
: