Target
Son of sevenless homolog 1 [564-1049]
Ligand
BDBM525119
Substrate
Meas. Tech.
Surface Plasmon Resonance (SPR) Assay
IC50
24.4±n/a nM
Citation
 Gill, ALBuckl, AKoltun, ESAay, NTambo-ong, AAThompson, SGliedt, MJKnox, JECregg, JEdwards, AVLiu, YBurnett, GL Bicyclic heteroaryl compounds and uses thereof US Patent  US11168102 Publication Date 11/9/2021 
Target
Name:
Son of sevenless homolog 1 [564-1049]
Synonyms:
SOS1 Son of sevenless homolog 1 (SOS1)(564-1049)
Type:
Enzyme Catalytic Domain
Mol. Mass.:
56970.22
Organism:
Description:
aa 564-1049
Residue:
486
 
Inhibitor
Name:
BDBM525119
Synonyms:
US11168102, Example 28-5.
Type:
Small organic molecule
Emp. Form.:
C24H25F3N4O4S
Mol. Mass.:
522.54
SMILES:
C[C@@H](Nc1ncnc2n(C)c(=O)c(cc12)C1(O)CC2CCC(C1)S2(=O)=O)c1cccc(C(F)F)c1F
: