Target
Son of sevenless homolog 1 [564-1049]
Ligand
BDBM525145
Substrate
Meas. Tech.
Surface Plasmon Resonance (SPR) Assay
IC50
19.1±n/a nM
Citation
 Gill, ALBuckl, AKoltun, ESAay, NTambo-ong, AAThompson, SGliedt, MJKnox, JECregg, JEdwards, AVLiu, YBurnett, GL Bicyclic heteroaryl compounds and uses thereof US Patent  US11168102 Publication Date 11/9/2021 
Target
Name:
Son of sevenless homolog 1 [564-1049]
Synonyms:
SOS1 Son of sevenless homolog 1 (SOS1)(564-1049)
Type:
Enzyme Catalytic Domain
Mol. Mass.:
56970.22
Organism:
Description:
aa 564-1049
Residue:
486
 
Inhibitor
Name:
BDBM525145
Synonyms:
US11168102, Example 32-24.
Type:
Small organic molecule
Emp. Form.:
C24H28F3N5O4S
Mol. Mass.:
539.57
SMILES:
COC1(CCN(CC1)S(C)(=O)=O)c1cc2c(N[C@H](C)c3cccc(C(F)F)c3F)ncnc2n(C)c1=O
: