Target
Replicase polyprotein 1ab
Ligand
BDBM525183
Substrate
Meas. Tech.
SARS-CoV-2 3CLPpro inhibition assay
IC50
2.00±n/a nM
Citation
 Chen, JLiang, CMIAO, KWu, YYun, HZhang, W Aminocarbamoyl compounds for the treatment of viral infections WIPO 0:0 (2022) Target
Name:
Replicase polyprotein 1ab
Synonyms:
ORF1ab polyprotein pp1ab | rep
Type:
Protein
Mol. Mass.:
794070.71
Organism:
2019-nCoV
Description:
P0DTD1
Residue:
7096
  
Inhibitor
Name:
BDBM525183
Synonyms:
N-[(1S)-2-[2-(3-Amino-3-oxo-propyl)-2-(2-chloroacetyl)hydrazino]-1-(cyclohexylmethyl)-2-oxo-ethyl]-1H-indole-2-carboxamide | WO2022043374, Example 35
Type:
Small organic molecule
Emp. Form.:
C23H30ClN5O4
Mol. Mass.:
475.968
SMILES:
NC(=O)CCN(NC(=O)[C@H](CC1CCCCC1)NC(=O)c1cc2ccccc2[nH]1)C(=O)CCl
: