Target
Replicase polyprotein 1ab
Ligand
BDBM525211
Substrate
Meas. Tech.
SARS-CoV-2 3CLPpro inhibition assay
IC50
3.00±n/a nM
Citation
 Chen, JLiang, CMIAO, KWu, YYun, HZhang, W Aminocarbamoyl compounds for the treatment of viral infections WIPO 0:0 (2022) Target
Name:
Replicase polyprotein 1ab
Synonyms:
ORF1ab polyprotein pp1ab | rep
Type:
Protein
Mol. Mass.:
794070.71
Organism:
2019-nCoV
Description:
P0DTD1
Residue:
7096
  
Inhibitor
Name:
BDBM525211
Synonyms:
WO2022043374, Example 56-B
Type:
Small organic molecule
Emp. Form.:
C24H31ClFN5O5
Mol. Mass.:
523.985
SMILES:
COc1cccc2[nH]c(cc12)C(=O)N[C@@H](CC1CCCCC1)C(=O)NN(CCC(N)=O)C(=O)[C@H](F)Cl
: