Target
Replicase polyprotein 1ab
Ligand
BDBM525215
Substrate
Meas. Tech.
SARS-CoV-2 3CLPpro inhibition assay
IC50
7.00±n/a nM
Citation
 Chen, JLiang, CMIAO, KWu, YYun, HZhang, W Aminocarbamoyl compounds for the treatment of viral infections WIPO 0:0 (2022) Target
Name:
Replicase polyprotein 1ab
Synonyms:
ORF1ab polyprotein pp1ab | rep
Type:
Protein
Mol. Mass.:
794070.71
Organism:
2019-nCoV
Description:
P0DTD1
Residue:
7096
  
Inhibitor
Name:
BDBM525215
Synonyms:
WO2022043374, Example 58-B
Type:
Small organic molecule
Emp. Form.:
C20H24Cl2FN5O4
Mol. Mass.:
488.34
SMILES:
CC(C)C[C@H](NC(=O)c1cc2cc(Cl)ccc2[nH]1)C(=O)NN(CCC(N)=O)C(=O)[C@H](F)Cl
: