Target
Replicase polyprotein 1ab
Ligand
BDBM525230
Substrate
Meas. Tech.
HCoV-229E 3CLpro inhibition assay
IC50
33±n/a nM
Citation
 Chen, JLiang, CMIAO, KWu, YYun, HZhang, W Aminocarbamoyl compounds for the treatment of viral infections WIPO 0:0 (2022) Target
Name:
Replicase polyprotein 1ab
Synonyms:
ORF1ab polyprotein pp1ab | rep
Type:
Protein
Mol. Mass.:
754187.17
Organism:
HCoV-229E
Description:
P0C6X1
Residue:
6758
  
Inhibitor
Name:
BDBM525230
Synonyms:
WO2022043374, Example 72
Type:
Small organic molecule
Emp. Form.:
C19H25ClFN5O5
Mol. Mass.:
457.884
SMILES:
Cc1cc(no1)C(=O)N[C@@H](CC1CCC1)C(=O)NN(C[C@H]1CCNC1=O)C(=O)[C@H](F)Cl
: