Target
Ectonucleotide pyrophosphatase/phosphodiesterase family member 2
Ligand
BDBM303698
Substrate
Meas. Tech.
Quanta Red Assay
IC50
1.000±n/a nM
Citation
 Blum, FCarr, JLShah, PDel Mar Jimenez Quesada, MGutierrez, IF Autotaxin inhibitors US Patent  US10138230 Publication Date 11/27/2018 
Target
Name:
Ectonucleotide pyrophosphatase/phosphodiesterase family member 2
Synonyms:
ATX Autotaxin (ATX) ENPP2 Ectonucleotide Pyrophosphatase/Phosphodiesterase 2 (ENPP2) Extracellular lysophospholipase D PDNP2
Type:
Enzyme
Mol. Mass.:
99007.13
Organism:
Homo sapiens (Human)
Description:
Q13822
Residue:
863
  
Inhibitor
Name:
BDBM303698
Synonyms:
5-[2-(4- chlorophenyl)ethyl]-N-[1- [4-(morpholino- methyl)phenyl]-5-oxo- pyrrolidine-3-yl]- 1,3,4-thiadiazole-2- carboxamide | US10138230, Example F128
Type:
Small organic molecule
Emp. Form.:
C26H28ClN5O3S
Mol. Mass.:
526.05
SMILES:
Clc1ccc(CCc2nnc(s2)C(=O)NC2CN(C(=O)C2)c2ccc(CN3CCOCC3)cc2)cc1
: