Target
Ectonucleotide pyrophosphatase/phosphodiesterase family member 2
Ligand
BDBM303716
Substrate
Meas. Tech.
Quanta Red Assay
IC50
1.000±n/a nM
Citation
 Blum, FCarr, JLShah, PDel Mar Jimenez Quesada, MGutierrez, IF Autotaxin inhibitors US Patent  US10138230 Publication Date 11/27/2018 
Target
Name:
Ectonucleotide pyrophosphatase/phosphodiesterase family member 2
Synonyms:
ATX Autotaxin (ATX) ENPP2 Ectonucleotide Pyrophosphatase/Phosphodiesterase 2 (ENPP2) Extracellular lysophospholipase D PDNP2
Type:
Enzyme
Mol. Mass.:
99007.13
Organism:
Homo sapiens (Human)
Description:
Q13822
Residue:
863
  
Inhibitor
Name:
BDBM303716
Synonyms:
(3S)-N-[5-[2-(4- chlorophenyyl) ethyl]isoxazol- 3-yl]-5-oxo-1-[4-(1- piperidylmethyl)phenyl] pyrrolidine-3- carboxamide | US10138230, Example F146
Type:
Small organic molecule
Emp. Form.:
C28H31ClN4O3
Mol. Mass.:
507.024
SMILES:
[H][C@]1(CN(C(=O)C1)c1ccc(CN2CCCCC2)cc1)C(=O)Nc1cc(CCc2ccc(Cl)cc2)on1
: