Target
Ectonucleotide pyrophosphatase/phosphodiesterase family member 2
Ligand
BDBM303780
Substrate
Meas. Tech.
Quanta Red Assay
IC50
1.000±n/a nM
Citation
 Blum, FCarr, JLShah, PDel Mar Jimenez Quesada, MGutierrez, IF Autotaxin inhibitors US Patent  US10138230 Publication Date 11/27/2018 
Target
Name:
Ectonucleotide pyrophosphatase/phosphodiesterase family member 2
Synonyms:
ATX Autotaxin (ATX) ENPP2 Ectonucleotide Pyrophosphatase/Phosphodiesterase 2 (ENPP2) Extracellular lysophospholipase D PDNP2
Type:
Enzyme
Mol. Mass.:
99007.13
Organism:
Homo sapiens (Human)
Description:
Q13822
Residue:
863
  
Inhibitor
Name:
BDBM303780
Synonyms:
(3S)-N-[5-[2-(4- chlorophenyl)ethyl]- 1,3,4-thiadiazol-2-yl]-1- [4-(2-oxa-6- azaspiro[3.3]heptan-6- ylmethyl)phenyl]-5-oxo- pyrrolidine-3- carboxamide | US10138230, Example F213
Type:
Small organic molecule
Emp. Form.:
C27H30ClN5O3S2
Mol. Mass.:
572.142
SMILES:
S.Clc1ccc(CCc2nnc(NC(=O)[C@@H]3CN(C(=O)C3)c3ccc(CN4CC5(COC5)C4)cc3)s2)cc1
: