Target
Fibroblast growth factor receptor 3
Ligand
BDBM261924
Substrate
Meas. Tech.
Enzymatic Assay
IC50
<10±n/a nM
Citation
 Sokolsky, AWu, LYao, W Bicyclic heterocycles as FGFR4 inhibitors US Patent  US11173162 Publication Date 11/16/2021 
Target
Name:
Fibroblast growth factor receptor 3
Synonyms:
CD_antigen: CD333 FGFR3 Fibroblast growth factor receptor JTK4
Type:
Protein
Mol. Mass.:
87699.57
Organism:
Homo sapiens (Human)
Description:
P22607
Residue:
806
  
Inhibitor
Name:
BDBM261924
Synonyms:
2-(5-(3-(2,6-difluoro-3,5-dimethoxyphenyl)-1-ethyl-2-oxo-1,2,3,4-tetrahydropyrido[4,3-d]pyrimidin-7-yl)pyridin-2-yl)-2-methylpropanenitrile US10632126, Example 26 US9708318, 26
Type:
Small organic molecule
Emp. Form.:
C26H25F2N5O3
Mol. Mass.:
493.5052
SMILES:
CCN1C(=O)N(Cc2cnc(cc12)-c1ccc(nc1)C(C)(C)C#N)c1c(F)c(OC)cc(OC)c1F
: