Target
Fibroblast growth factor receptor 1
Ligand
BDBM262004
Substrate
Meas. Tech.
Enzymatic Assay
IC50
115±n/a nM
Citation
 Sokolsky, AWu, LYao, W Bicyclic heterocycles as FGFR4 inhibitors US Patent  US11173162 Publication Date 11/16/2021 
Target
Name:
Fibroblast growth factor receptor 1
Synonyms:
BFGFR Basic fibroblast growth factor receptor 1 (FGFR1) CEK FGFR-1 FGFR-1, (FL) FGFR1_HUMAN FLT2 Fibroblast growth factor receptor 1 (FGFR-1) Fms-like tyrosine kinase 2 N-sam bFGF-R | c-fgr
Type:
Receptor
Mol. Mass.:
91861.70
Organism:
Homo sapiens (Human)
Description:
P11362
Residue:
822
  
Inhibitor
Name:
BDBM262004
Synonyms:
3-(2,6-difluoro-3,5- dimethoxyphenyl)-1-(3,5- difluorophenyl)-7-(1,3-dimethyl- 1H-pyrazol-4-yl)-3,4- dihydropyrido[4,3-d]pyrimidin- 2(1H)-one US10632126, Example 103 US9708318, 103
Type:
Small organic molecule
Emp. Form.:
C26H21F4N5O3
Mol. Mass.:
527.4703
SMILES:
COc1cc(OC)c(F)c(N2Cc3cnc(cc3N(C2=O)c2cc(F)cc(F)c2)-c2cn(C)nc2C)c1F
: