Target
Fibroblast growth factor receptor 2
Ligand
BDBM262004
Substrate
Meas. Tech.
Enzymatic Assay
IC50
20±n/a nM
Citation
 Sokolsky, AWu, LYao, W Bicyclic heterocycles as FGFR4 inhibitors US Patent  US11173162 Publication Date 11/16/2021 
Target
Name:
Fibroblast growth factor receptor 2
Synonyms:
BEK FGFR-2 FGFR2 Fibroblast growth factor receptor 2 (FGFR2) KGFR Keratinocyte growth factor receptor VEGF-receptor 2 and Fibroblast growth factor receptor 2
Type:
Enzyme
Mol. Mass.:
92015.45
Organism:
Homo sapiens (Human)
Description:
P21802
Residue:
821
  
Inhibitor
Name:
BDBM262004
Synonyms:
3-(2,6-difluoro-3,5- dimethoxyphenyl)-1-(3,5- difluorophenyl)-7-(1,3-dimethyl- 1H-pyrazol-4-yl)-3,4- dihydropyrido[4,3-d]pyrimidin- 2(1H)-one US10632126, Example 103 US9708318, 103
Type:
Small organic molecule
Emp. Form.:
C26H21F4N5O3
Mol. Mass.:
527.4703
SMILES:
COc1cc(OC)c(F)c(N2Cc3cnc(cc3N(C2=O)c2cc(F)cc(F)c2)-c2cn(C)nc2C)c1F
: