Target
Cyclin-A2/Cyclin-dependent kinase 2
Ligand
BDBM525717
Substrate
Meas. Tech.
Z′-LYTE Assay
IC50
0.700±n/a nM
Citation
 Pham, SMChakravarty, SKankanala, JPujala, BShete, ABhatt, BAgarwal, AKSoni, SChen, J Heterocyclic compounds as kinase inhibitors US Patent  US11174252 Publication Date 11/16/2021 
Target
Name:
Cyclin-A2/Cyclin-dependent kinase 2
Synonyms:
CDK2-CyclinA CDK2/Cyclin A Cyclin A2/dependent kinase 2 Cyclin-Dependent Kinase 2 (CDK2A)
Type:
Protein Complex
Mol. Mass.:
Description:
Cdk2/Cyclin A kinase was purified from insect cells coinfected with Cyclin A/Cdk2 baculovirus.
Components:
This complex has 2 components.
Component 1
Name:
Cyclin-dependent kinase 2
Synonyms:
CDK2 CDK2_HUMAN Cell division protein kinase 2 Protein cereblon/Cyclin-dependent kinase 2 | p33 protein kinase
Type:
Enzyme Subunit
Mol. Mass.:
33938.17
Organism:
Homo sapiens (Human)
Description:
P24941
Residue:
298
  
Component 2
Name:
Cyclin-A2
Synonyms:
CCN1 CCNA1 CCNA2_HUMAN Cyclin-A
Type:
Enzyme Subunit
Mol. Mass.:
48550.19
Organism:
Homo sapiens (Human)
Description:
P20248
Residue:
432
  
Inhibitor
Name:
BDBM525717
Synonyms:
US11174252, Compound 12
Type:
Small organic molecule
Emp. Form.:
C25H27F3N6O
Mol. Mass.:
484.5167
SMILES:
CC(C)N1CCOc2c(F)cc(cc12)-c1nc(Nc2ccc(N3CCNCC3)c(F)c2)ncc1F
: