Target
Cyclin-dependent kinase 4
Ligand
BDBM525763
Substrate
Meas. Tech.
In Vitro Kinase Inhibition Assay
IC50
0.500±n/a nM
Citation
 Pham, SMChakravarty, SKankanala, JPujala, BShete, ABhatt, BAgarwal, AKSoni, SChen, J Heterocyclic compounds as kinase inhibitors US Patent  US11174252 Publication Date 11/16/2021 
Target
Name:
Cyclin-dependent kinase 4
Synonyms:
CDK4 Cell division protein kinase 4 PSK-J3
Type:
Enzyme Subunit
Mol. Mass.:
33731.96
Organism:
Homo sapiens (Human)
Description:
P11802
Residue:
303
  
Inhibitor
Name:
BDBM525763
Synonyms:
US11174252, Compound 450
Type:
Small organic molecule
Emp. Form.:
C29H35F2N7O2
Mol. Mass.:
551.6307
SMILES:
CC(C)N1CCOc2c(F)cc(cc12)-c1nc(Nc2ccc(cn2)C2CCN(CC2)C(=O)CN(C)C)ncc1F
: