Target
Tyrosine-protein kinase BTK
Ligand
BDBM525848
Substrate
Meas. Tech.
Lantha Screening Kinase Reaction Assay
IC50
55.0±n/a nM
Citation
 Guo, SZhou, FChen, XZhao, JHuang, DXie, JQiao, CHe, WZhang, KChen, XLan, J Aniline-substituted 1,2-dihydropyrrol[3,4-C]pyridin/pyrimidin-3-one derivative and use thereof US Patent  US11174254 Publication Date 11/16/2021 
Target
Name:
Tyrosine-protein kinase BTK
Synonyms:
AGMX1 Agammaglobulinaemia tyrosine kinase B cell progenitor kinase BPK BTK_HUMAN Tyrosine Kinase BTK Tyrosine-protein kinase BTK (BTK)
Type:
Enzyme
Mol. Mass.:
76289.95
Organism:
Homo sapiens (Human)
Description:
Q06187
Residue:
659
  
Inhibitor
Name:
BDBM525848
Synonyms:
US11174254, Compound G-9
Type:
Small organic molecule
Emp. Form.:
C22H24N8O3
Mol. Mass.:
448.4778
SMILES:
CC(C)(O)Cn1cc(Nc2nc(Nc3cccc(NC(=O)C=C)c3)nc3CNC(=O)c23)cn1
: