Target
Epidermal growth factor receptor
Ligand
BDBM525841
Substrate
Meas. Tech.
EGFR Kinase Inhibition Assay
IC50
4688±n/a nM
Citation
 Guo, SZhou, FChen, XZhao, JHuang, DXie, JQiao, CHe, WZhang, KChen, XLan, J Aniline-substituted 1,2-dihydropyrrol[3,4-C]pyridin/pyrimidin-3-one derivative and use thereof US Patent  US11174254 Publication Date 11/16/2021 
Target
Name:
Epidermal growth factor receptor
Synonyms:
EGF Receptor Substrate EGFR_HUMAN ERBB1 Epidermal Growth Factor Receptor erbB-1 Epidermal growth factor receptor (EGFR) HER1 Proto-oncogene c-ErbB-1 Tyrosine-Protein Kinase ErbB-1
Type:
Receptor Kinase Domain
Mol. Mass.:
134279.59
Organism:
Homo sapiens (Human)
Description:
P00533
Residue:
1210
  
Inhibitor
Name:
BDBM525841
Synonyms:
US11174254, Compound G-2
Type:
Small organic molecule
Emp. Form.:
C24H24N6O4
Mol. Mass.:
460.4852
SMILES:
COCCOc1ccc(Nc2nc(Nc3cccc(NC(=O)C=C)c3)nc3CNC(=O)c23)cc1
: