Target
Sodium channel protein type 1 subunit alpha
Ligand
BDBM525928
Substrate
Meas. Tech.
Sodium Influx Assay (In Vitro Assay)
IC50
301±n/a nM
Citation
 Andrez, JBogucki, DEBurford, KNChowdhury, SCohen, CJDecker, SMDehnhardt, CMDevita, RJEmpfield, JRFocken, TGrimwood, MEHasan, SAJia, QJohnson, Jr., JPWilson, MSZenova, AY Benzenesulfonamide compouds and their use as therapeutic agents US Patent  US11174268 Publication Date 11/16/2021 
Target
Name:
Sodium channel protein type 1 subunit alpha
Synonyms:
NAC1 SCN1A Sodium (Site 1) Sodium channel protein type 1 subunit alpha Sodium channel protein type I subunit alpha Voltage-gated sodium channel subunit alpha Nav1.1
Type:
Protein
Mol. Mass.:
228952.47
Organism:
Homo sapiens (Human)
Description:
P35498
Residue:
2009
  
Inhibitor
Name:
BDBM525928
Synonyms:
(R)-3-chloro-4-((2,3-dihydro-1H-inden-1-yl)amino)-N-(1,2,4-thiadiazol-5-yl)benzenesulfonamide | US11174268, Example 35
Type:
Small organic molecule
Emp. Form.:
C17H15ClN4O2S2
Mol. Mass.:
406.91
SMILES:
Clc1cc(ccc1N[C@@H]1CCc2ccccc12)S(=O)(=O)Nc1ncns1
: