Target
Sodium channel protein type 1 subunit alpha
Ligand
BDBM525934
Substrate
Meas. Tech.
Sodium Influx Assay (In Vitro Assay)
IC50
364±n/a nM
Citation
 Andrez, JBogucki, DEBurford, KNChowdhury, SCohen, CJDecker, SMDehnhardt, CMDevita, RJEmpfield, JRFocken, TGrimwood, MEHasan, SAJia, QJohnson, Jr., JPWilson, MSZenova, AY Benzenesulfonamide compouds and their use as therapeutic agents US Patent  US11174268 Publication Date 11/16/2021 
Target
Name:
Sodium channel protein type 1 subunit alpha
Synonyms:
NAC1 SCN1A Sodium (Site 1) Sodium channel protein type 1 subunit alpha Sodium channel protein type I subunit alpha Voltage-gated sodium channel subunit alpha Nav1.1
Type:
Protein
Mol. Mass.:
228952.47
Organism:
Homo sapiens (Human)
Description:
P35498
Residue:
2009
  
Inhibitor
Name:
BDBM525934
Synonyms:
5-chloro-2-fluoro-N-(thiazol-2-yl)-4-((3,3,3-trifluoro-1-phenylpropyl)amino)benzenesulfonamide | US11174268, Example 41
Type:
Small organic molecule
Emp. Form.:
C18H14ClF4N3O2S2
Mol. Mass.:
479.899
SMILES:
Fc1cc(NC(CC(F)(F)F)c2ccccc2)c(Cl)cc1S(=O)(=O)Nc1nccs1
: