Target
Sodium channel protein type 1 subunit alpha
Ligand
BDBM525978
Substrate
Meas. Tech.
Sodium Influx Assay (In Vitro Assay)
IC50
516±n/a nM
Citation
 Andrez, JBogucki, DEBurford, KNChowdhury, SCohen, CJDecker, SMDehnhardt, CMDevita, RJEmpfield, JRFocken, TGrimwood, MEHasan, SAJia, QJohnson, Jr., JPWilson, MSZenova, AY Benzenesulfonamide compouds and their use as therapeutic agents US Patent  US11174268 Publication Date 11/16/2021 
Target
Name:
Sodium channel protein type 1 subunit alpha
Synonyms:
NAC1 SCN1A Sodium (Site 1) Sodium channel protein type 1 subunit alpha Sodium channel protein type I subunit alpha Voltage-gated sodium channel subunit alpha Nav1.1
Type:
Protein
Mol. Mass.:
228952.47
Organism:
Homo sapiens (Human)
Description:
P35498
Residue:
2009
  
Inhibitor
Name:
BDBM525978
Synonyms:
2,5-difluoro-4-((1-phenylpropyl)amino)-N-(1,2,4-thiadiazol-5-yl)benzenesulfonamide | US11174268, Example 85
Type:
Small organic molecule
Emp. Form.:
C17H16F2N4O2S2
Mol. Mass.:
410.461
SMILES:
CCC(Nc1cc(F)c(cc1F)S(=O)(=O)Nc1ncns1)c1ccccc1
: