Target
Sodium channel protein type 1 subunit alpha
Ligand
BDBM525991
Substrate
Meas. Tech.
Sodium Influx Assay (In Vitro Assay)
IC50
303±n/a nM
Citation
 Andrez, JBogucki, DEBurford, KNChowdhury, SCohen, CJDecker, SMDehnhardt, CMDevita, RJEmpfield, JRFocken, TGrimwood, MEHasan, SAJia, QJohnson, Jr., JPWilson, MSZenova, AY Benzenesulfonamide compouds and their use as therapeutic agents US Patent  US11174268 Publication Date 11/16/2021 
Target
Name:
Sodium channel protein type 1 subunit alpha
Synonyms:
NAC1 SCN1A Sodium (Site 1) Sodium channel protein type 1 subunit alpha Sodium channel protein type I subunit alpha Voltage-gated sodium channel subunit alpha Nav1.1
Type:
Protein
Mol. Mass.:
228952.47
Organism:
Homo sapiens (Human)
Description:
P35498
Residue:
2009
  
Inhibitor
Name:
BDBM525991
Synonyms:
5-chloro-2-fluoro-4-((5,6,7,8-tetrahydroquinolin-5-yl)amino)-N-(thiazol-2-yl)benzenesulfonamide formate | US11174268, Example 98
Type:
Small organic molecule
Emp. Form.:
C18H16ClFN4O2S2
Mol. Mass.:
438.927
SMILES:
Fc1cc(NC2CCCc3ncccc23)c(Cl)cc1S(=O)(=O)Nc1nccs1
: