Target
Sodium channel protein type 1 subunit alpha
Ligand
BDBM526019
Substrate
Meas. Tech.
Sodium Influx Assay (In Vitro Assay)
IC50
147±n/a nM
Citation
 Andrez, JBogucki, DEBurford, KNChowdhury, SCohen, CJDecker, SMDehnhardt, CMDevita, RJEmpfield, JRFocken, TGrimwood, MEHasan, SAJia, QJohnson, Jr., JPWilson, MSZenova, AY Benzenesulfonamide compouds and their use as therapeutic agents US Patent  US11174268 Publication Date 11/16/2021 
Target
Name:
Sodium channel protein type 1 subunit alpha
Synonyms:
NAC1 SCN1A Sodium (Site 1) Sodium channel protein type 1 subunit alpha Sodium channel protein type I subunit alpha Voltage-gated sodium channel subunit alpha Nav1.1
Type:
Protein
Mol. Mass.:
228952.47
Organism:
Homo sapiens (Human)
Description:
P35498
Residue:
2009
  
Inhibitor
Name:
BDBM526019
Synonyms:
(S)-2-fluoro-5-methyl-4-((1-phenylpropyl)thio)-N-(thiazol-2-yl)benzenesulfonamide | US11174268, Example 126
Type:
Small organic molecule
Emp. Form.:
C19H19FN2O2S3
Mol. Mass.:
422.56
SMILES:
CC[C@H](Sc1cc(F)c(cc1C)S(=O)(=O)Nc1nccs1)c1ccccc1
: