Target
Sodium channel protein type 1 subunit alpha
Ligand
BDBM526036
Substrate
Meas. Tech.
Electrophysiological Assay (In Vitro Assay)
IC50
159±n/a nM
Citation
 Andrez, JBogucki, DEBurford, KNChowdhury, SCohen, CJDecker, SMDehnhardt, CMDevita, RJEmpfield, JRFocken, TGrimwood, MEHasan, SAJia, QJohnson, Jr., JPWilson, MSZenova, AY Benzenesulfonamide compouds and their use as therapeutic agents US Patent  US11174268 Publication Date 11/16/2021 
Target
Name:
Sodium channel protein type 1 subunit alpha
Synonyms:
NAC1 SCN1A Sodium (Site 1) Sodium channel protein type 1 subunit alpha Sodium channel protein type I subunit alpha Voltage-gated sodium channel subunit alpha Nav1.1
Type:
Protein
Mol. Mass.:
228952.47
Organism:
Homo sapiens (Human)
Description:
P35498
Residue:
2009
  
Inhibitor
Name:
BDBM526036
Synonyms:
5-chloro-2-fluoro-4-(3-methyl-1-phenylbutylamino)-N-(thiazol-2-yl)benzenesulfonamide | US11174268, Example 143
Type:
Small organic molecule
Emp. Form.:
C21H23ClFN3O2S2
Mol. Mass.:
468.008
SMILES:
CCC(C)CC(Nc1cc(F)c(cc1Cl)S(=O)(=O)Nc1nccs1)c1ccccc1
: