Target
Sodium channel protein type 1 subunit alpha
Ligand
BDBM526159
Substrate
Meas. Tech.
Electrophysiological Assay (In Vitro Assay)
IC50
133±n/a nM
Citation
 Andrez, JBogucki, DEBurford, KNChowdhury, SCohen, CJDecker, SMDehnhardt, CMDevita, RJEmpfield, JRFocken, TGrimwood, MEHasan, SAJia, QJohnson, Jr., JPWilson, MSZenova, AY Benzenesulfonamide compouds and their use as therapeutic agents US Patent  US11174268 Publication Date 11/16/2021 
Target
Name:
Sodium channel protein type 1 subunit alpha
Synonyms:
NAC1 SCN1A Sodium (Site 1) Sodium channel protein type 1 subunit alpha Sodium channel protein type I subunit alpha Voltage-gated sodium channel subunit alpha Nav1.1
Type:
Protein
Mol. Mass.:
228952.47
Organism:
Homo sapiens (Human)
Description:
P35498
Residue:
2009
  
Inhibitor
Name:
BDBM526159
Synonyms:
(S)-5-chloro-2-fluoro-4-((1-(2-fluorophenyl)ethyl)amino)-N-(5-fluorothiazol-2-yl)benzenesulfonamide | US11174268, Example 266
Type:
Small organic molecule
Emp. Form.:
C17H13ClF3N3O2S2
Mol. Mass.:
447.882
SMILES:
C[C@H](Nc1cc(F)c(cc1Cl)S(=O)(=O)Nc1ncc(F)s1)c1ccccc1F
: