Target
DNA-binding protein Ikaros
Ligand
BDBM526267
Substrate
Meas. Tech.
Prolabel Quantification of IKZF1, IKZF2, or GSPT1 Protein Levels in 293GT Cells
EC50
>30000±n/a nM
Citation
 Beckwith, REBonazzi, SCernijenko, AMa, FWare, NF 3-(5-amino-1-oxoisoindolin-2-yl)piperidine-2,6-dione derivatives and uses thereof US Patent  US11185537 Publication Date 11/30/2021 
Target
Name:
DNA-binding protein Ikaros
Synonyms:
DNA-binding protein Ikaros IKAROS IKZF1_HUMAN LYF1 ZNFN1A1
Type:
PROTEIN
Mol. Mass.:
57528.78
Organism:
Homo sapiens
Description:
ChEMBL_120150
Residue:
519
  
Inhibitor
Name:
BDBM526267
Synonyms:
3-(5-(((1S,2S)-2- ((cyclohexylmethyl)amino) cyclohexyl)amino)-1- oxoisoindolin-2-yl)piperidine-2,6-dione | US11185537, Compound I-12
Type:
Small organic molecule
Emp. Form.:
C26H36N4O3
Mol. Mass.:
452.589
SMILES:
O=C1N(Cc2cc(N[C@H]3CCCC[C@@H]3NCC3CCCCC3)ccc12)C1CCC(=O)NC1=O
: