Target
DNA-binding protein Ikaros
Ligand
BDBM526272
Substrate
Meas. Tech.
Prolabel Quantification of IKZF1, IKZF2, or GSPT1 Protein Levels in 293GT Cells
EC50
5200±n/a nM
Citation
 Beckwith, REBonazzi, SCernijenko, AMa, FWare, NF 3-(5-amino-1-oxoisoindolin-2-yl)piperidine-2,6-dione derivatives and uses thereof US Patent  US11185537 Publication Date 11/30/2021 
Target
Name:
DNA-binding protein Ikaros
Synonyms:
DNA-binding protein Ikaros IKAROS IKZF1_HUMAN LYF1 ZNFN1A1
Type:
PROTEIN
Mol. Mass.:
57528.78
Organism:
Homo sapiens
Description:
ChEMBL_120150
Residue:
519
  
Inhibitor
Name:
BDBM526272
Synonyms:
5-(((1S,2S)-2-aminocyclohexyl) (methyl)amino)- 2-(2,6-dioxopiperidin-3-yl) isoindoline-1,3-dione | US11185537, Compound I-99
Type:
Small organic molecule
Emp. Form.:
C20H24N4O4
Mol. Mass.:
384.429
SMILES:
CN([C@H]1CCCC[C@@H]1N)c1ccc2C(=O)N(C3CCC(=O)NC3=O)C(=O)c2c1
: