Target
DNA-binding protein Ikaros
Ligand
BDBM526283
Substrate
Meas. Tech.
Prolabel Quantification of IKZF1, IKZF2, or GSPT1 Protein Levels in 293GT Cells
EC50
>30000±n/a nM
Citation
 Beckwith, REBonazzi, SCernijenko, AMa, FWare, NF 3-(5-amino-1-oxoisoindolin-2-yl)piperidine-2,6-dione derivatives and uses thereof US Patent  US11185537 Publication Date 11/30/2021 
Target
Name:
DNA-binding protein Ikaros
Synonyms:
DNA-binding protein Ikaros IKAROS IKZF1_HUMAN LYF1 ZNFN1A1
Type:
PROTEIN
Mol. Mass.:
57528.78
Organism:
Homo sapiens
Description:
ChEMBL_120150
Residue:
519
  
Inhibitor
Name:
BDBM526283
Synonyms:
US11185537, Compound 1-148
Type:
Small organic molecule
Emp. Form.:
C22H26N4O6
Mol. Mass.:
442.465
SMILES:
CN([C@H]1CCCC[C@@H]1NCC(O)=O)c1ccc2C(=O)N(C3CCC(=O)NC3=O)C(=O)c2c1
: