Target
Mu-type opioid receptor
Ligand
BDBM438904
Substrate
Meas. Tech.
Receptor Binding Assay
Ki
<1±n/a nM
Citation
 Wynn, TAAlvarez, JCMoustakas, DTHaeberlein, MPennington, LD Compounds for the treatment of pain US Patent  US11180455 Publication Date 11/23/2021 
Target
Name:
Mu-type opioid receptor
Synonyms:
M-OR-1 MOR-1 MUOR1 Mu opiate receptor OPRM1 hMOP | mu-type opioid receptor isoform MOR-1
Type:
G Protein-Coupled Receptor (GPCR)
Mol. Mass.:
44789.51
Organism:
Homo sapiens (Human)
Description:
P35372
Residue:
400
  
Inhibitor
Name:
BDBM438904
Synonyms:
3-((1R,5S,9r)-3-(2-(2,5-dioxopyrrolidin-1-yl)ethyl)-9-methoxy-3-azabicyclo[3.3.1]nonan-9-yl)benzamide hydrochloride US11180455, Compound 65
Type:
Small organic molecule
Emp. Form.:
C22H29N3O4
Mol. Mass.:
399.4834
SMILES:
COC1(C2CCCC1CN(CCN1C(=O)CCC1=O)C2)c1cccc(c1)C(N)=O
: