Target
Mu-type opioid receptor
Ligand
BDBM438920
Substrate
Meas. Tech.
Receptor Binding Assay
Ki
<1±n/a nM
Citation
 Wynn, TAAlvarez, JCMoustakas, DTHaeberlein, MPennington, LD Compounds for the treatment of pain US Patent  US11180455 Publication Date 11/23/2021 
Target
Name:
Mu-type opioid receptor
Synonyms:
M-OR-1 MOR-1 MUOR1 Mu opiate receptor OPRM1 hMOP | mu-type opioid receptor isoform MOR-1
Type:
G Protein-Coupled Receptor (GPCR)
Mol. Mass.:
44789.51
Organism:
Homo sapiens (Human)
Description:
P35372
Residue:
400
  
Inhibitor
Name:
BDBM438920
Synonyms:
4-((1R,5S,9r)-9-methoxy-3-(2-oxaspiro[3.3]heptan-6-yl)-3-azabicyclo[3.3.1]nonan-9-yl)picolinamide (S)-2-hydroxysuccinate US11180455, Compound 81
Type:
Small organic molecule
Emp. Form.:
C21H29N3O3
Mol. Mass.:
371.4733
SMILES:
COC1(C2CCCC1CN(C2)C1CC2(COC2)C1)c1ccnc(c1)C(N)=O
: