Target
Plasma kallikrein
Ligand
BDBM408730
Substrate
Meas. Tech.
Inhibitory Activity In Vitro
IC50
1800±n/a nM
Citation
 Davie, RLEdwards, HJEvans, DMHodgson, ST N-((het)arylmethyl)-heteroaryl-carboxamides compounds as kallikrein inhibitors US Patent  US11198691 Publication Date 12/14/2021 
Target
Name:
Plasma kallikrein
Synonyms:
Fletcher factor KLKB1 Kallikrein Plasma kallikrein heavy chain Plasma prekallikrein
Type:
Protein
Mol. Mass.:
71391.16
Organism:
Homo sapiens (Human)
Description:
P03952
Residue:
638
  
Inhibitor
Name:
BDBM408730
Synonyms:
N-[(4-carbamoylphenyl)methyl]-3-cyclopropyl-1-({4-[(2-oxopyridin-1- yl)methyl]phenyl}methyl)pyrazole-4-carboxamide US11001578, Example 50 US11198691, Example 50
Type:
Small organic molecule
Emp. Form.:
C28H27N5O3
Mol. Mass.:
481.5457
SMILES:
NC(=O)c1ccc(CNC(=O)c2cn(Cc3ccc(Cn4ccccc4=O)cc3)nc2C2CC2)cc1
: