Target
Dihydroorotate dehydrogenase (quinone), mitochondrial
Ligand
BDBM530455
Substrate
Meas. Tech.
DHODH enzymatic assay
IC50
1.40±n/a nM
Citation
 Lindsey, DScott, KZhuming, Z DIHYDROOROTATE DEHYDROGENASE INHIBITORS WIPO 0:0 (2022) Target
Name:
Dihydroorotate dehydrogenase (quinone), mitochondrial
Synonyms:
DHODH Dihydroorotate dehydrogenase Dihydroorotate dehydrogenase, mitochondrial Dihydroorotate oxidase (DHODH) | PYRD_HUMAN
Type:
Enzyme
Mol. Mass.:
42881.33
Organism:
Homo sapiens (Human)
Description:
Q02127
Residue:
395
  
Inhibitor
Name:
BDBM530455
Synonyms:
2-(3-Chloro-6-methylpyridin-2-yl)-7-fluoro-6-(2-(2-hydroxypropan-2-yl)-1-methyl- 1H-imidazol-4-yl)-4-isopropylisoquinolin-1(2H)-one. | WO2022070068, Example 27
Type:
Small organic molecule
Emp. Form.:
C25H26ClFN4O2
Mol. Mass.:
468.951
SMILES:
CC(C)c1cn(-c2nc(C)ccc2Cl)c(=O)c2cc(F)c(cc12)-c1cn(C)c(n1)C(C)(C)O
: