Target
Diacylglycerol O-acyltransferase 2
Ligand
BDBM530592
Substrate
Meas. Tech.
DGAT2 enzymatic activity assay
IC50
24±n/a nM
Citation
 Yeon-Hee, LR., AEJianming, BChen, CP., RJHelen, SE PREPARATION OF BENZIMIDAZOLONE DERIVATIVES AS NOVEL DIACYLGLYCERIDE O-ACYLTRANSFERASE 2 INHIBITORS WIPO 0:0 (2022) Target
Name:
Diacylglycerol O-acyltransferase 2
Synonyms:
ARAT DGAT2 Diacylglycerol O-acyltransferase 2 (DGAT2) Retinol O-fatty-acyltransferase
Type:
Multi-pass membrane protein
Mol. Mass.:
43848.90
Organism:
Homo sapiens (Human)
Description:
Q96PD7
Residue:
388
  
Inhibitor
Name:
BDBM530592
Synonyms:
WO2022076495, EXAMPLE 38
Type:
Small organic molecule
Emp. Form.:
C25H27F2N3O5S
Mol. Mass.:
519.561
SMILES:
C[C@]1(CCS(=O)(=O)C1)NC(=O)c1ccc2n(-c3cccc(OC(F)F)c3)c(=O)n(C3CCCC3)c2c1
: