Target
Glycogen synthase kinase-3 alpha
Ligand
BDBM8255
Substrate
Biotinylated Peptide Substrate
Meas. Tech.
Kinase Inhibition SPA Assay
IC50
20±n/a nM
Citation
 Smith, DGBuffet, MFenwick, AEHaigh, DIfe, RJSaunders, MSlingsby, BPStacey, RWard, RW 3-Anilino-4-arylmaleimides: potent and selective inhibitors of glycogen synthase kinase-3 (GSK-3). Bioorg Med Chem Lett 11:635-9 (2001)  
Target
Name:
Glycogen synthase kinase-3 alpha
Synonyms:
GSK-3 alpha GSK3A_HUMAN Glycogen synthase kinase-3 Glycogen synthase kinase-3 alpha (GSK3 Alpha) Glycogen synthase kinase-3 alpha (GSK3alpha)
Type:
Enzyme
Mol. Mass.:
50991.79
Organism:
Homo sapiens (Human)
Description:
P49840
Residue:
483
  
Inhibitor
Name:
BDBM8255
Synonyms:
3-[(3,5-dichloro-4-hydroxyphenyl)amino]-4-(3-nitrophenyl)-2,5-dihydro-1H-pyrrole-2,5-dione | 4-arylmaleimide deriv. 6-l
Type:
Small organic molecule
Emp. Form.:
C16H9Cl2N3O5
Mol. Mass.:
394.166
SMILES:
Oc1c(Cl)cc(NC2=C(C(=O)NC2=O)c2cccc(c2)N(=O)=O)cc1Cl
:
Substrate
Name:
Biotinylated Peptide Substrate
Synonyms:
Type:
Peptide
Mol. Mass.:
3615.87
Organism:
Description:
Residue:
32