Target
Receptor tyrosine-protein kinase erbB-2
Ligand
BDBM304252
Substrate
Meas. Tech.
SKBR3 Cell Viability Assay for Antibody-Polymer-Drug Conjugates
IC50
1.50±n/a nM
Citation
 Yin, MThomas, JDYurkovetskiy, AVConlon, PRDu, BKelleher, EWLowinger, TBTang, S Pyrrolobenzodiazepines and conjugates thereof US Patent  US10143695 Publication Date 12/4/2018 
Target
Name:
Receptor tyrosine-protein kinase erbB-2
Synonyms:
2.7.10.1 CD_antigen=CD340 ERBB2_HUMAN FASN/HER2 HER2 MLN19 NEU Proto-oncogene Neu Tyrosine kinase-type cell surface receptor HER2 | p185erbB2
Type:
Mol. Mass.:
137894.47
Organism:
Homo sapiens (Human)
Description:
P04626
Residue:
1255
  
Inhibitor
Name:
BDBM304252
Synonyms:
US10143695, Compound 69
Type:
Small organic molecule
Emp. Form.:
C42H45N9O8
Mol. Mass.:
803.8622
SMILES:
COc1cc2c(cc1OCCCC(=O)Nc1cc(C(=O)Nc3cc(C(=O)Nc4cc(C(=O)NCCCO)n(C)c4)n(C)c3)n(C)c1)N=C[C@@H]1Cc3ccccc3N1C2=O
: