Target
Receptor tyrosine-protein kinase erbB-2
Ligand
BDBM304254
Substrate
Meas. Tech.
MCF7 Cell Viability Assay for Antibody-Polymer-Drug Conjugates
IC50
1.90±n/a nM
Citation
 Yin, MThomas, JDYurkovetskiy, AVConlon, PRDu, BKelleher, EWLowinger, TBTang, S Pyrrolobenzodiazepines and conjugates thereof US Patent  US10143695 Publication Date 12/4/2018 
Target
Name:
Receptor tyrosine-protein kinase erbB-2
Synonyms:
2.7.10.1 CD_antigen=CD340 ERBB2_HUMAN FASN/HER2 HER2 MLN19 NEU Proto-oncogene Neu Tyrosine kinase-type cell surface receptor HER2 | p185erbB2
Type:
Mol. Mass.:
137894.47
Organism:
Homo sapiens (Human)
Description:
P04626
Residue:
1255
  
Inhibitor
Name:
BDBM304254
Synonyms:
US10143695, Compound 78
Type:
Small organic molecule
Emp. Form.:
C46H43N11O7
Mol. Mass.:
861.9031
SMILES:
COc1cc2c(cc1OCCCC(=O)Nc1cn(C)c(n1)C(=O)Nc1cc(C(=O)Nc3cc(C(=O)n4ccc5cc(N)ccc45)n(C)c3)n(C)c1)N=C[C@@H]1Cc3ccccc3N1C2=O
: