Target
Receptor tyrosine-protein kinase erbB-2
Ligand
BDBM304258
Substrate
Meas. Tech.
NCI-N87 Cell Viability Assay for Antibody-Polymer-Drug Conjugates
IC50
1.50±n/a nM
Citation
 Yin, MThomas, JDYurkovetskiy, AVConlon, PRDu, BKelleher, EWLowinger, TBTang, S Pyrrolobenzodiazepines and conjugates thereof US Patent  US10143695 Publication Date 12/4/2018 
Target
Name:
Receptor tyrosine-protein kinase erbB-2
Synonyms:
2.7.10.1 CD_antigen=CD340 ERBB2_HUMAN FASN/HER2 HER2 MLN19 NEU Proto-oncogene Neu Tyrosine kinase-type cell surface receptor HER2 | p185erbB2
Type:
Mol. Mass.:
137894.47
Organism:
Homo sapiens (Human)
Description:
P04626
Residue:
1255
  
Inhibitor
Name:
BDBM304258
Synonyms:
US10143695, Compound 84
Type:
Small organic molecule
Emp. Form.:
C35H34N10O6
Mol. Mass.:
690.7079
SMILES:
Cn1cc(NC(=O)c2nc(NC(=O)CCCOc3cc4N=C[C@@H]5CC(=C)CN5C(=O)c4cc3O)cn2C)cc1C(=O)Nc1cnc2[nH]ccc2c1
: