Target
Replicase polyprotein 1ab
Ligand
BDBM533525
Substrate
Meas. Tech.
MTase Filter-Binding Assay (FBA)
IC50
960±100 nM
Citation
 Ahmed-Belkacem, RHausdorff, MDelpal, ASutto-Ortiz, PColmant, AMGTouret, FOgando, NSSnijder, EJCanard, BCoutard, BVasseur, JJDecroly, EDebart, F Potent Inhibition of SARS-CoV-2 nsp14  J Med Chem 65:6231-6249 (2022)  
Target
Name:
Replicase polyprotein 1ab
Synonyms:
ORF1ab polyprotein pp1ab | rep
Type:
Protein
Mol. Mass.:
794070.71
Organism:
2019-nCoV
Description:
P0DTD1
Residue:
7096
  
Inhibitor
Name:
BDBM533525
Synonyms:
jm2c00120, Compound 24
Type:
Small Organic Molecule
Emp. Form.:
C19H21N7O5S
Mol. Mass.:
459.479
SMILES:
CCN(C[C@H]1O[C@H]([C@H](O)[C@@H]1O)n1cnc2c(N)ncnc12)S(=O)(=O)c1cccc(c1)C#N
: