Target
Mixed lineage kinase domain-like protein
Ligand
BDBM534328
Substrate
Meas. Tech.
MLKL Phosphorylation High-Content Assay
IC50
0.30±n/a nM
Citation
 Guanglin, LJie, CDiane, DCB., FDJunqing, GC., HAXirui, HE., MMReiser, PMJianliang, SH., SSLee, VBYong-Jin, WZili, XG., YM TRIAZOLOPYRIDINYL COMPOUNDS AS KINASE INHIBITORS WIPO 0:0 (2022) Target
Name:
Mixed lineage kinase domain-like protein
Synonyms:
MLKL Mixed lineage kinase domain-like protein | hMLKL
Type:
PROTEIN
Mol. Mass.:
54493.57
Organism:
Homo sapiens
Description:
ChEMBL_104428
Residue:
471
  
Inhibitor
Name:
BDBM534328
Synonyms:
WO2022086828, Example 55
Type:
Small organic molecule
Emp. Form.:
C24H21F4N5O2
Mol. Mass.:
487.4495
SMILES:
Cc1ccc(-c2ccn3nc(N)nc3c2)c(F)c1C(=O)NCCC(O)c1ccc(cc1)C(F)(F)F
: