Target
Receptor-interacting serine/threonine-protein kinase 1
Ligand
BDBM534281
Substrate
Meas. Tech.
RIPK1 HTRF Binding Assay
IC50
6.20±n/a nM
Citation
 Guanglin, LJie, CDiane, DCB., FDJunqing, GC., HAXirui, HE., MMReiser, PMJianliang, SH., SSLee, VBYong-Jin, WZili, XG., YM TRIAZOLOPYRIDINYL COMPOUNDS AS KINASE INHIBITORS WIPO 0:0 (2022) Target
Name:
Receptor-interacting serine/threonine-protein kinase 1
Synonyms:
Cell death protein RIP RIP-1 RIPK1 Receptor-interacting protein 1
Type:
Enzyme Catalytic Domain
Mol. Mass.:
75926.99
Organism:
Homo sapiens (Human)
Description:
Q13546
Residue:
671
  
Inhibitor
Name:
BDBM534281
Synonyms:
WO2018148626, Example 9 | WO2022086828, Example 9
Type:
Small organic molecule
Emp. Form.:
C23H21F2N5O2
Mol. Mass.:
437.4419
SMILES:
Cc1cc(F)c(cc1C(=O)NCC[C@@H](O)c1ccc(F)cc1)-c1ccn2nc(N)nc2c1
: