Target
Mixed lineage kinase domain-like protein
Ligand
BDBM534281
Substrate
Meas. Tech.
MLKL Phosphorylation High-Content Assay
IC50
2.40±n/a nM
Citation
 Guanglin, LJie, CDiane, DCB., FDJunqing, GC., HAXirui, HE., MMReiser, PMJianliang, SH., SSLee, VBYong-Jin, WZili, XG., YM TRIAZOLOPYRIDINYL COMPOUNDS AS KINASE INHIBITORS WIPO 0:0 (2022) Target
Name:
Mixed lineage kinase domain-like protein
Synonyms:
MLKL Mixed lineage kinase domain-like protein | hMLKL
Type:
PROTEIN
Mol. Mass.:
54493.57
Organism:
Homo sapiens
Description:
ChEMBL_104428
Residue:
471
  
Inhibitor
Name:
BDBM534281
Synonyms:
WO2018148626, Example 9 | WO2022086828, Example 9
Type:
Small organic molecule
Emp. Form.:
C23H21F2N5O2
Mol. Mass.:
437.4419
SMILES:
Cc1cc(F)c(cc1C(=O)NCC[C@@H](O)c1ccc(F)cc1)-c1ccn2nc(N)nc2c1
: