Target
Replicase polyprotein 1ab
Ligand
BDBM535159
Substrate
Meas. Tech.
SARS-CoV-2 Coronavirus 3C Protease FRET Assay
Ki
6.02±n/a nM
Citation
 Rhys, ODYoungjin, PMRichard, RMForrest, SMBryce, TJQingyi, Y ANTIVIRAL HETEROARYL KETONE DERIVATIVES WIPO 0:0 (2022) Target
Name:
Replicase polyprotein 1ab
Synonyms:
ORF1ab polyprotein pp1ab | rep
Type:
Protein
Mol. Mass.:
794070.71
Organism:
2019-nCoV
Description:
P0DTD1
Residue:
7096
  
Inhibitor
Name:
BDBM535159
Synonyms:
WO2022013684, Example 14
Type:
Small organic molecule
Emp. Form.:
C32H43N5O5S
Mol. Mass.:
609.779
SMILES:
CC(C)C(=O)N[C@H](C(=O)N1C[C@H]2[C@@H]([C@H]1C(=O)N[C@@H](C[C@@H]1CCNC1=O)C(=O)c1nc3ccccc3s1)C2(C)C)C(C)(C)C
: