Target
Calpain-1 catalytic subunit
Ligand
BDBM535883
Substrate
Meas. Tech.
Assay for the Determination of the Capacity to Inhibit Calpain 1
IC50
7.10±n/a nM
Citation
 Llenas Calvo, JRoyo Expósito, MElezcano Donaire, UVázquez Tatay, EMelgarejo Díaz, MBarranco Gallardo, MIMedina Fuentes, EM Dipeptidyl ketoamide meta-methoxyphenyl derivatives and uses thereof US Patent  US11242312 Publication Date 2/8/2022 
Target
Name:
Calpain-1 catalytic subunit
Synonyms:
CAN1_HUMAN CAPN1 Calpain-1 (u-Calpain) Calpain1
Type:
Protein
Mol. Mass.:
81880.51
Organism:
Homo sapiens (Human)
Description:
Residue:
714
  
Inhibitor
Name:
BDBM535883
Synonyms:
US11242312, Example 4
Type:
Small organic molecule
Emp. Form.:
C25H29N3O6
Mol. Mass.:
467.5143
SMILES:
CONC(=O)C(=O)C(Cc1ccccc1)NC(=O)[C@H](CC1CC1)NC(=O)c1cccc(OC)c1
: