Target
Tyrosine-protein kinase JAK1
Ligand
BDBM539139
Substrate
Meas. Tech.
Biochemical JAK Kinase Assay
Ki
0.050±n/a nM
Citation
 Fatheree, PRBrandt, GESmith, CSullivan, SDVan Orden, LJ Fused imidazo-piperidine JAK inhibitors US Patent  US11254669 Publication Date 2/22/2022 
Target
Name:
Tyrosine-protein kinase JAK1
Synonyms:
JAK-1 JAK1A JAK1_HUMAN Janus kinase 1 (JAK1) | Janus kinase 1 JAK1
Type:
Protein
Mol. Mass.:
133293.73
Organism:
Homo sapiens (Human)
Description:
P23458
Residue:
1154
  
Inhibitor
Name:
BDBM539139
Synonyms:
US11254669, Example 1-2
Type:
Small organic molecule
Emp. Form.:
C27H30FN7O2
Mol. Mass.:
503.5712
SMILES:
CCc1cc(O)c(F)cc1-c1ccc2c(n[nH]c2c1)-c1nc2CC(NCc2[nH]1)C(=O)N1CCN(C)CC1
: