Target
Large envelope protein
Ligand
BDBM540698
Substrate
Meas. Tech.
Test Method of EC50 of Anti HBV
EC50
5.00±n/a nM
Citation
 Liu, XRen, QYan, GGoldmann, SZhang, Y Dihydropyrimidine compounds and uses thereof in medicine US Patent  US11261190 Publication Date 3/1/2022 
Target
Name:
Large envelope protein
Synonyms:
HBSAG_HBVD3 | S
Type:
Mol. Mass.:
42772.52
Organism:
Hepatitis B virus
Description:
P03138
Residue:
389
  
Inhibitor
Name:
BDBM540698
Synonyms:
US11261190, Example 22
Type:
Small organic molecule
Emp. Form.:
C32H32BrFN6O5S
Mol. Mass.:
711.601
SMILES:
CCOC(=O)C1=C(CN2CCN3[C@H](CN(C3=O)c3ccc(CCC(O)=O)cc3)C2)NC(=N[C@H]1c1ccc(F)cc1Br)c1nccs1
: