Target
Large envelope protein
Ligand
BDBM540733
Substrate
Meas. Tech.
Test Method of EC50 of Anti HBV
EC50
5.00±n/a nM
Citation
 Liu, XRen, QYan, GGoldmann, SZhang, Y Dihydropyrimidine compounds and uses thereof in medicine US Patent  US11261190 Publication Date 3/1/2022 
Target
Name:
Large envelope protein
Synonyms:
HBSAG_HBVD3 | S
Type:
Mol. Mass.:
42772.52
Organism:
Hepatitis B virus
Description:
P03138
Residue:
389
  
Inhibitor
Name:
BDBM540733
Synonyms:
US11261190, Example 61B
Type:
Small organic molecule
Emp. Form.:
C34H36ClFN6O6S
Mol. Mass.:
711.203
SMILES:
COC[C@@H]1[C@H]2CN(C(=O)N2CCN1CC1=C([C@@H](N=C(N1)c1nccs1)c1ccc(F)cc1Cl)C(=O)OC)c1ccc(cc1)C(C)(C)OC=O
: